{"text_format":"1","workbook":"xlsx","n_sheets":5,"sheets":["Lookups","Instructions","Calculator_Manual","Calculator_PPG Toners","Data"],"not_rendered":{"charts":0,"images":1,"macros":1,"external_links":0,"defined_names":7,"comments":0,"pivot_tables":0},"unopened":[],"bounds":{"document_bytes":16777216,"sheet_cells":100000,"rows_first":2000,"rows_last":500,"rows_between":2000,"halvings":0,"cell_chars":16384,"cell_head_chars":4096},"cells_cut":0,"cells_raw":0,"read":"whole","date_system":"1900"}

{"sheet":"Lookups","index":0,"n_rows":52,"n_cols":13,"rows_kept":52,"cut":false,"hidden":true,"merged":[]}
["Lookup Table"]
[]
[-999,"",1]
[12,"CAUTION - You have overfilled this aerosol can.  Max 12 oz fill.",2]
[999,null,3]
[]
[]
["Fill Weight Limits"]
[null,"Grams","Oz"]
["15993",180,9999]
["61003",100,9999]
["61993",9999,3.03]
["62003",9999,3.03]
["62013",9999,3.03]
[]
[]
[]
["MIR Calculation"]
["Additions","Part Number","Volume (oz)","MIR","Weighted MIR",null,null,null,"Part","Description","Fill Wgt (oz)","Max Fill (oz)","CA MIR"]
[null,15993,5.43,0.45100000000000001,{"$f":"ROUND(+C20*D20,4)","v":2.4489000000000001},null,null,null,"15993","Color Coat - Universal Color Coat",5.4320987654320989,12,0.45100000000000001]
[1,null,null,null,null,null,null,null,"61003","Multi-Coat Aerosol Blank",8.4656084656084651,12,0.505]
[2,null,null,null,null,null,null,null,"61993","Custom Fill Aerosol Blank",8.3950617283950617,{"$f":"ROUND(+K22+3,2)","v":11.4},0.505]
[3,null,null,null,null,null,null,null,"62003","Custom Fill Waterborne Aerosol Blank",7.0546737213403876,10,0.64500000000000002]
[4,null,null,null,null,null,null,null,"62013","Custom Fill+ High Build Aerosol Blank",3.8800705467372132,6.9,0.45100000000000001]
[5]
["Totals"]
["Calculated MIR (Weighted MIR / Volume)"]
[]
[]
[]
["bg"]
["density (lbs per gallon)",8.27]
["grams per lb",454]
["total grams in density",{"$f":"+B33*B32","v":3754.58}]
["no in mix",40]
["portion of gallon",{"$f":"+B35/B34","v":1.0653655002690048E-2}]
["oz",{"$f":"+B36*128","v":1.3636678403443261}]
[]
[]
["grams per lb",454]
["oz per gallon",128]
[]
[]
[]
[]
[]
["OZ per UOM","OZ"]
["Half Pint",6]
["Pint",16]
["Quart",32]
["Half Gallon",64]
["Gallon",128]

{"sheet":"Instructions","index":1,"n_rows":35,"n_cols":9,"rows_kept":35,"cut":false,"hidden":false,"merged":[]}
[null,null,null,null,null,null,null,null,"2019-10-10"]
[]
[]
[]
[]
[]
[]
[]
[]
[]
[]
[]
[]
[]
[]
[]
[]
[]
[]
[]
[]
[]
[]
[]
["Additional Instructions and Helpful Tips"]
[]
["Information on aerosol blanks"]
["https://www.semproducts.com/products/refinish/aerosol-filling"]
[]
["SOP on how to fill an aerosol blank can"]
["https://www.semproducts.com/blog/filling-custom-filltm-aerosol-blanks-standard-operating-procedure-sop"]
[]
["SEM Contact Info:"]
["Technical - 1-800-831-1122  -  tech@semproducts.com"]
["Customer Care - 1-866-327-7829  -  custcare@semproducts.com"]

{"sheet":"Calculator_Manual","index":2,"n_rows":43,"n_cols":14,"rows_kept":43,"cut":false,"hidden":false,"merged":[[33,1,34,8]]}
[null,null,null,null,null,"**  HIDE  **",null,14]
[null,null,2,"lookup column",null,6,12,10]
[null,"MANUAL ENTRY"]
[]
[]
[null,"MIR Calculator using California MIR Values",null,"Enter data in yellow",null,null,null,null,"MIR Calculated"]
[null,{"$f":"NOW()","v":"2019-12-05T10:33:20.850"},null,null,null,null,null,null,{"$f":"IFERROR(ROUND(+I29/G29,2),0)","v":0}]
[]
[]
[null,"Part Number","Description",null,null,"Density","Fill (Oz)","Ingredient MIR","Weighted MIR"]
["SEM Aerosol Part No",null,{"$f":"IFERROR(IFERROR(VLOOKUP($B11,adds,C$2,FALSE),VLOOKUP(TEXT($B11,0),adds,C$2,FALSE)),\"\")","v":""},null,null,{"$f":"IFERROR(ROUND(IFERROR(VLOOKUP($B11,adds,F$2,FALSE),VLOOKUP(TEXT($B11,0),adds,F$2,FALSE)),4),0)","v":0},{"$f":"IFERROR(ROUND(IFERROR(VLOOKUP($B11,adds,G$2,FALSE),VLOOKUP(TEXT($B11,0),adds,G$2,FALSE)),4),0)","v":0},{"$f":"IFERROR(ROUND(IFERROR(VLOOKUP($B11,adds,H$2,FALSE),VLOOKUP(TEXT($B11,0),adds,H$2,FALSE)),4),0)","v":0},{"$f":"IFERROR(ROUND(+G11*H11,4),0)","v":0}]
[null,{"$f":"IFERROR(IFERROR(VLOOKUP(B11,Lookups!$I$20:$M$24,4,FALSE),VLOOKUP(TEXT(B11,0),Lookups!$I$20:$M$24,4,FALSE)),\"\")","v":""},"oz Total recommended fill",{"$f":"IF(ISBLANK(B11),0,+B12-G11)","v":0},"oz Liquid Fill"]
[]
[null,"Enter Paint Formula Details Below"]
[null,"Volume","Quart",{"$f":"VLOOKUP(C15,uom,2,FALSE)","v":32},"US Fluid Oz"]
[null,"Part Number","Description","Grams Added (individual)","Grams for Custom Fill","Density","Fill (Oz)","Ingredient MIR","Weighted MIR"]
["Part No 1",null,{"$f":"IFERROR(IFERROR(VLOOKUP($B17,adds,C$2,FALSE),VLOOKUP(TEXT($B17,0),adds,C$2,FALSE)),\"\")","v":""},null,{"$f":"+D17*D$12/D$15","v":0},{"$f":"IFERROR(ROUND(IFERROR(VLOOKUP($B17,adds,F$2,FALSE),VLOOKUP(TEXT($B17,0),adds,F$2,FALSE)),4),0)","v":0},{"$f":"IFERROR(ROUND(+E17/(F17*454)*128,4),0)","v":0},{"$f":"IFERROR(ROUND(IFERROR(VLOOKUP($B17,adds,H$2,FALSE),VLOOKUP(TEXT($B17,0),adds,H$2,FALSE)),4),0)","v":0},{"$f":"IFERROR(ROUND(+G17*H17,4),0)","v":0}]
["Part No 2",null,"",null,0,0,{"$f":"IFERROR(ROUND(+E18/(F18*454)*128,4),0)","v":0},0,0]
["Part No 3",null,"",null,0,0,0,0,0]
["Part No 4",null,"",null,0,0,0,0,0]
["Part No 5",null,"",null,0,0,0,0,0]
["Part No 6",null,"",null,{"$f":"+D22*D$12/D$15","v":0},0,0,0,0]
["Part No 7",null,"",null,{"$f":"+D23*D$12/D$15","v":0},0,0,0,0]
["Part No 8",null,"",null,0,0,0,0,0]
["Part No 9",null,"",null,0,0,0,0,0]
["Part No 10",null,"",null,0,0,0,0,0]
[null,"Total Adds",null,{"$f":"SUM(D17:D26)","v":0},{"$f":"SUM(E17:E26)","v":0},null,{"$f":"SUM(G17:G26)","v":0},null,{"$f":"SUM(I17:I26)","v":0}]
[null,null,null,{"$f":"IFERROR(IF(D27>VLOOKUP(TEXT(B11,0),Lookups!A10:C14,2,FALSE),\"OVERFILLED\",\"\"),\"\")","v":""},null,null,{"$f":"IFERROR(IF(G27>VLOOKUP(TEXT(B11,0),Lookups!A10:C14,3,FALSE),\"OVERFILLED\",\"\"),\"\")","v":""}]
[null,"Grand Total",null,null,null,null,{"$f":"+G27+G11","v":0},null,{"$f":"+I27+I11","v":0}]
[]
[null,"Calculator Notes:"]
[null,"See instructions on instructions tab"]
[]
[null,"Please consult local, state and national regulations for important regulatory guidelines.  California's Regulation for Reducing the Ozone Formed from Aerosol Coating Product Emissions can be found at the link below and those limits govern consumption in California."]
[]
[null,"https://ww3.arb.ca.gov/consprod/regs/2019/article_3_final_5_2019.pdf"]
[]
[null,"SEM Contact Info:"]
[null,"Technical - 1-800-831-1122  -  tech@semproducts.com"]
[null,"Customer Care - 1-866-327-7829  -  custcare@semproducts.com"]
[null,null,null,null,null,null,null,null,null,null,null,null,null,{"$f":"+I7","v":0}]
[null,null,null,null,null,null,null,null,null,null,null,"Category","","MIR value"]
[null,null,null,null,null,null,null,null,null,null,null,null,null,{"$f":"NOW()","v":"2019-12-05T10:33:20.850"}]

{"sheet":"Calculator_PPG Toners","index":3,"n_rows":43,"n_cols":14,"rows_kept":43,"cut":false,"hidden":false,"merged":[[33,1,34,8]]}
[null,null,null,null,null,"**  HIDE  **",null,14]
[null,null,2,"lookup column",null,6,12,10]
[null,"CALCULATOR FOR PPG TONERS"]
[]
[]
[null,"MIR Calculator using California MIR Values",null,"Enter data in yellow",null,null,null,null,"MIR Calculated"]
[null,{"$f":"NOW()","v":"2019-12-05T10:33:20.850"},null,null,null,null,null,null,{"$f":"IFERROR(ROUND(+I29/G29,2),0)","v":0}]
[]
[]
[null,"Part Number","Description",null,null,"Density","Fill (Oz)","Ingredient MIR","Weighted MIR"]
["SEM Aerosol Part No",null,{"$f":"IFERROR(IFERROR(VLOOKUP($B11,adds,C$2,FALSE),VLOOKUP(TEXT($B11,0),adds,C$2,FALSE)),\"\")","v":""},null,null,{"$f":"IFERROR(ROUND(IFERROR(VLOOKUP($B11,adds,F$2,FALSE),VLOOKUP(TEXT($B11,0),adds,F$2,FALSE)),4),0)","v":0},{"$f":"IFERROR(ROUND(IFERROR(VLOOKUP($B11,adds,G$2,FALSE),VLOOKUP(TEXT($B11,0),adds,G$2,FALSE)),4),0)","v":0},{"$f":"IFERROR(ROUND(IFERROR(VLOOKUP($B11,adds,H$2,FALSE),VLOOKUP(TEXT($B11,0),adds,H$2,FALSE)),4),0)","v":0},{"$f":"IFERROR(ROUND(+G11*H11,4),0)","v":0}]
[null,{"$f":"IFERROR(IFERROR(VLOOKUP(B11,Lookups!$I$20:$M$24,4,FALSE),VLOOKUP(TEXT(B11,0),Lookups!$I$20:$M$24,4,FALSE)),\"\")","v":""},"oz Total recommended fill",{"$f":"IF(ISBLANK(B11),0,+B12-G11)","v":0},"oz Liquid Fill"]
[]
[null,"Enter Paint Formula Details Below"]
[null,"Volume","Pint",{"$f":"VLOOKUP(C15,uom,2,FALSE)","v":16},"US Fluid Oz"]
[null,"Part Number","Description","Grams Added (individual)","Grams for Custom Fill","Density","Fill (Oz)","Ingredient MIR","Weighted MIR"]
["Part No 1",null,{"$f":"IFERROR(IFERROR(VLOOKUP($B17,adds,C$2,FALSE),VLOOKUP(TEXT($B17,0),adds,C$2,FALSE)),\"\")","v":""},null,{"$f":"+D17*D$12/D$15","v":0},{"$f":"IFERROR(ROUND(IFERROR(VLOOKUP($B17,adds,F$2,FALSE),VLOOKUP(TEXT($B17,0),adds,F$2,FALSE)),4),0)","v":0},{"$f":"IFERROR(ROUND(+E17/(F17*454)*128,4),0)","v":0},{"$f":"IFERROR(ROUND(IFERROR(VLOOKUP($B17,adds,H$2,FALSE),VLOOKUP(TEXT($B17,0),adds,H$2,FALSE)),4),0)","v":0},{"$f":"IFERROR(ROUND(+G17*H17,4),0)","v":0}]
["Part No 2",null,"",null,0,0,{"$f":"IFERROR(ROUND(+E18/(F18*454)*128,4),0)","v":0},0,0]
["Part No 3",null,"",null,0,0,0,0,0]
["Part No 4",null,"",null,0,0,0,0,0]
["Part No 5",null,"",null,0,0,0,0,0]
["Part No 6",null,"",null,0,0,0,0,0]
["Part No 7",null,"",null,0,0,0,0,0]
["Part No 8",null,"",null,0,0,0,0,0]
["Part No 9",null,"",null,0,0,0,0,0]
["Part No 10",null,"",null,0,0,0,0,0]
[null,"Total Adds",null,{"$f":"SUM(D17:D26)","v":0},{"$f":"SUM(E17:E26)","v":0},null,{"$f":"SUM(G17:G26)","v":0},null,{"$f":"SUM(I17:I26)","v":0}]
[null,null,null,{"$f":"IFERROR(IF(D27>VLOOKUP(TEXT(B11,0),Lookups!A10:C14,2,FALSE),\"OVERFILLED\",\"\"),\"\")","v":""},null,null,{"$f":"IFERROR(IF(G27>VLOOKUP(TEXT(B11,0),Lookups!A10:C14,3,FALSE),\"OVERFILLED\",\"\"),\"\")","v":""}]
[null,"Grand Total",null,null,null,null,{"$f":"+G27+G11","v":0},null,{"$f":"+I27+I11","v":0}]
[]
[null,"Calculator Notes:"]
[null,"See instructions on instructions tab"]
[]
[null,"Please consult local, state and national regulations for important regulatory guidelines.  California's Regulation for Reducing the Ozone Formed from Aerosol Coating Product Emissions can be found at the link below and those limits govern consumption in California."]
[]
[null,"https://ww3.arb.ca.gov/consprod/regs/2019/article_3_final_5_2019.pdf"]
[]
[null,"SEM Contact Info:"]
[null,"Technical - 1-800-831-1122  -  tech@semproducts.com"]
[null,"Customer Care - 1-866-327-7829  -  custcare@semproducts.com"]
[null,null,null,null,null,null,null,null,null,null,null,null,null,{"$f":"+I7","v":0}]
[null,null,null,null,null,null,null,null,null,null,null,"Category","","MIR value"]
[null,null,null,null,null,null,null,null,null,null,null,null,null,{"$f":"NOW()","v":"2019-12-05T10:33:20.850"}]

{"sheet":"Data","index":4,"n_rows":388,"n_cols":13,"rows_kept":388,"cut":false,"hidden":true,"merged":[]}
["2019-10-10T06:35:00.190"]
[]
[]
[null,null,null,null,null,null,null,null,null,{"$f":"MAX(J7:J254)","v":7.39}]
[]
["Component Default Alias","Component Default Alias Description","Component Property","Paint System Code","Component ID","Density","Solid Content","Volume % Solids","Water Content","California MIR data",null,"OZ"]
[{"$f":"\"DBC500\"","v":"DBC500"},{"$f":"\"BLENDER\"","v":"BLENDER"},{"$f":"\"Base Maker\"","v":"Base Maker"},{"$f":"\"DBC MET\"","v":"DBC MET"},{"$f":"\"20000175\"","v":"20000175"},{"$f":"\"7.748\"","v":"7.748"},{"$f":"\"26.22\"","v":"26.22"},{"$f":"\"21.57\"","v":"21.57"},{"$f":"\"0\"","v":"0"},2.9914124570999996,0]
[{"$f":"\"DBX1689\"","v":"DBX1689"},{"$f":"\"CLEAR\"","v":"CLEAR"},{"$f":"\"Base Maker\"","v":"Base Maker"},"DBC MET",{"$f":"\"20000177\"","v":"20000177"},{"$f":"\"7.542\"","v":"7.542"},{"$f":"\"13.3\"","v":"13.3"},{"$f":"\"10.3\"","v":"10.3"},"0",3.1802423914600007,0]
[{"$f":"\"DCU2021\"","v":"DCU2021"},{"$f":"\"CLEAR\"","v":"CLEAR"},{"$f":"\"Mixing Clear\"","v":"Mixing Clear"},"DBC MET",{"$f":"\"20000181\"","v":"20000181"},{"$f":"\"7.933\"","v":"7.933"},{"$f":"\"49.3\"","v":"49.3"},{"$f":"\"43.33\"","v":"43.33"},"0",2.8927649999999998,0]
[{"$f":"\"DMD1602\"","v":"DMD1602"},{"$f":"\"GS YELLOW\"","v":"GS YELLOW"},{"$f":"\"Normal Solid\"","v":"Normal Solid"},"DBC MET",{"$f":"\"20000269\"","v":"20000269"},{"$f":"\"7.929\"","v":"7.929"},{"$f":"\"26.89\"","v":"26.89"},{"$f":"\"21.2\"","v":"21.2"},"0",3.3410467518729661,0]
[{"$f":"\"DMD1603\"","v":"DMD1603"},{"$f":"\"RED SHADE YELLOW\"","v":"RED SHADE YELLOW"},"Normal Solid","DBC MET",{"$f":"\"20000972\"","v":"20000972"},{"$f":"\"7.943\"","v":"7.943"},{"$f":"\"23.14\"","v":"23.14"},{"$f":"\"16.38\"","v":"16.38"},"0",3.2660370960965701,0]
[{"$f":"\"DMD1605\"","v":"DMD1605"},{"$f":"\"MAGENTA\"","v":"MAGENTA"},"Normal Solid","DBC MET",{"$f":"\"20000270\"","v":"20000270"},{"$f":"\"7.871\"","v":"7.871"},{"$f":"\"24.97\"","v":"24.97"},{"$f":"\"19.27\"","v":"19.27"},"0",3.7948912073327996,0]
[{"$f":"\"DMD1606\"","v":"DMD1606"},{"$f":"\"MAROON\"","v":"MAROON"},"Normal Solid","DBC MET",{"$f":"\"20000271\"","v":"20000271"},{"$f":"\"7.874\"","v":"7.874"},{"$f":"\"24.4\"","v":"24.4"},{"$f":"\"18.97\"","v":"18.97"},{"$f":"\"0.01\"","v":"0.01"},2.5506869864874817,0]
[{"$f":"\"DMD1607\"","v":"DMD1607"},{"$f":"\"BLUE\"","v":"BLUE"},"Normal Solid","DBC MET",{"$f":"\"20000272\"","v":"20000272"},{"$f":"\"7.969\"","v":"7.969"},{"$f":"\"28.13\"","v":"28.13"},{"$f":"\"21.68\"","v":"21.68"},{"$f":"\"0\"","v":"0"},3.2981815498905194,0]
[{"$f":"\"DMD1608\"","v":"DMD1608"},{"$f":"\"LF ORANGE\"","v":"LF ORANGE"},"Normal Solid","DBC MET",{"$f":"\"20000273\"","v":"20000273"},{"$f":"\"8.166\"","v":"8.166"},{"$f":"\"33.59\"","v":"33.59"},{"$f":"\"26.32\"","v":"26.32"},"0",3.0546470927613578,0]
[{"$f":"\"DMD1609\"","v":"DMD1609"},{"$f":"\"QUINDO VIOLET\"","v":"QUINDO VIOLET"},"Normal Solid","DBC MET",{"$f":"\"20000949\"","v":"20000949"},{"$f":"\"7.966\"","v":"7.966"},{"$f":"\"25.96\"","v":"25.96"},{"$f":"\"27.17\"","v":"27.17"},"0",2.5590001474039998,0]
[{"$f":"\"DMD1610\"","v":"DMD1610"},{"$f":"\"ORANGE\"","v":"ORANGE"},"Normal Solid","DBC MET",{"$f":"\"20000947\"","v":"20000947"},{"$f":"\"8.225\"","v":"8.225"},{"$f":"\"30.08\"","v":"30.08"},{"$f":"\"21.67\"","v":"21.67"},"0",2.012674861279812,0]
[{"$f":"\"DMD1611\"","v":"DMD1611"},{"$f":"\"ORANGE\"","v":"ORANGE"},"Normal Solid","DBC MET",{"$f":"\"64001010\"","v":"64001010"},{"$f":"\"8.037\"","v":"8.037"},{"$f":"\"33.85\"","v":"33.85"},{"$f":"\"27.71\"","v":"27.71"},"0",0,0]
[{"$f":"\"DMD1612\"","v":"DMD1612"},{"$f":"\"WEAK GOLD\"","v":"WEAK GOLD"},"Normal Solid","DBC MET",{"$f":"\"64000886\"","v":"64000886"},{"$f":"\"7.803\"","v":"7.803"},{"$f":"\"22.71\"","v":"22.71"},{"$f":"\"17.74\"","v":"17.74"},"0",1.4775223912658142,0]
[{"$f":"\"DMD1613\"","v":"DMD1613"},{"$f":"\"WEAK BLUE\"","v":"WEAK BLUE"},"Normal Solid","DBC MET",{"$f":"\"64000887\"","v":"64000887"},{"$f":"\"7.78\"","v":"7.78"},{"$f":"\"22.71\"","v":"22.71"},{"$f":"\"18.02\"","v":"18.02"},"0",2.9672300500947881,0]
[{"$f":"\"DMD1614\"","v":"DMD1614"},{"$f":"\"WEAK YELLOW OXIDE\"","v":"WEAK YELLOW OXIDE"},"Normal Solid","DBC MET",{"$f":"\"64000888\"","v":"64000888"},{"$f":"\"7.887\"","v":"7.887"},{"$f":"\"24.36\"","v":"24.36"},{"$f":"\"18.25\"","v":"18.25"},"0",2.8407060779658266,0]
[{"$f":"\"DMD1615\"","v":"DMD1615"},{"$f":"\"WEAK GREEN\"","v":"WEAK GREEN"},"Normal Solid","DBC MET",{"$f":"\"64000889\"","v":"64000889"},{"$f":"\"7.794\"","v":"7.794"},{"$f":"\"24.82\"","v":"24.82"},{"$f":"\"19.62\"","v":"19.62"},"0",1.829918916023648,0]
[{"$f":"\"DMD1616\"","v":"DMD1616"},{"$f":"\"WEAK RED\"","v":"WEAK RED"},"Normal Solid","DBC MET",{"$f":"\"64000890\"","v":"64000890"},{"$f":"\"7.768\"","v":"7.768"},{"$f":"\"22.74\"","v":"22.74"},{"$f":"\"18.14\"","v":"18.14"},"0",1.4781883824498141,0]
[{"$f":"\"DMD1621\"","v":"DMD1621"},{"$f":"\"FINE TITANIUM WHITE\"","v":"FINE TITANIUM WHITE"},{"$f":"\"Flop Adjuster/Tone controller\"","v":"Flop Adjuster/Tone controller"},"DBC MET",{"$f":"\"64001007\"","v":"64001007"},{"$f":"\"9.476\"","v":"9.476"},{"$f":"\"40.24\"","v":"40.24"},{"$f":"\"22.2\"","v":"22.2"},"0",2.5635793807476164,0]
[{"$f":"\"DMD1625\"","v":"DMD1625"},{"$f":"\"YELLOW\"","v":"YELLOW"},{"$f":"\"Normal Solid\"","v":"Normal Solid"},"DBC MET",{"$f":"\"64001011\"","v":"64001011"},{"$f":"\"10.951\"","v":"10.951"},{"$f":"\"50.91\"","v":"50.91"},{"$f":"\"26.65\"","v":"26.65"},"0",2.1454069059089043,0]
[{"$f":"\"DMD1627\"","v":"DMD1627"},{"$f":"\"INDO BLUE\"","v":"INDO BLUE"},"Normal Solid","DBC MET",{"$f":"\"64001055\"","v":"64001055"},{"$f":"\"7.916\"","v":"7.916"},{"$f":"\"31.39\"","v":"31.39"},{"$f":"\"24.93\"","v":"24.93"},"0",3.5447508221789006,0]
[{"$f":"\"DMD1628\"","v":"DMD1628"},{"$f":"\"PERYLENE VIOLET\"","v":"PERYLENE VIOLET"},"Normal Solid","DBC MET",{"$f":"\"64001213\"","v":"64001213"},{"$f":"\"8.018\"","v":"8.018"},{"$f":"\"30\"","v":"30"},{"$f":"\"24.07\"","v":"24.07"},"0",2.8213243735479479,0]
[{"$f":"\"DMD1630\"","v":"DMD1630"},{"$f":"\"CARMINE\"","v":"CARMINE"},"Normal Solid","DBC MET",{"$f":"\"64001241\"","v":"64001241"},{"$f":"\"7.839\"","v":"7.839"},{"$f":"\"26.43\"","v":"26.43"},{"$f":"\"21.15\"","v":"21.15"},"0",1.5574334811465962,0]
[{"$f":"\"DMD1632\"","v":"DMD1632"},{"$f":"\"OLIVE\"","v":"OLIVE"},"Normal Solid","DBC MET",{"$f":"\"64001231\"","v":"64001231"},{"$f":"\"8.064\"","v":"8.064"},{"$f":"\"26.91\"","v":"26.91"},{"$f":"\"20.24\"","v":"20.24"},"0",1.412796730624466,0]
[{"$f":"\"DMD1634\"","v":"DMD1634"},{"$f":"\"ORGANIC BROWN\"","v":"ORGANIC BROWN"},"Normal Solid","DBC MET",{"$f":"\"64001497\"","v":"64001497"},{"$f":"\"7.8\"","v":"7.8"},{"$f":"\"28.72\"","v":"28.72"},{"$f":"\"24.02\"","v":"24.02"},"0",2.8008634080556085,0]
[{"$f":"\"DMD1647\"","v":"DMD1647"},{"$f":"\"CARBON BLACK\"","v":"CARBON BLACK"},"Normal Solid","DBC MET",{"$f":"\"64001498\"","v":"64001498"},{"$f":"\"7.96\"","v":"7.96"},{"$f":"\"27.03\"","v":"27.03"},{"$f":"\"21.17\"","v":"21.17"},"0",2.9951186769131515,0]
[{"$f":"\"DMD1659\"","v":"DMD1659"},{"$f":"\"CLEAN RED-SHADE PHTHALO BLUE\"","v":"CLEAN RED-SHADE PHTHALO BLUE"},"Normal Solid","DBC MET",{"$f":"\"64001692\"","v":"64001692"},{"$f":"\"9.883\"","v":"9.883"},{"$f":"\"20.79\"","v":"20.79"},{"$f":"\"20.08\"","v":"20.08"},"0",0.75442842972799995,0]
[{"$f":"\"DMD1675\"","v":"DMD1675"},{"$f":"\"BLUE\"","v":"BLUE"},"Normal Solid","DBC MET",{"$f":"\"20000274\"","v":"20000274"},{"$f":"\"7.921\"","v":"7.921"},{"$f":"\"26.92\"","v":"26.92"},{"$f":"\"21.01\"","v":"21.01"},"0",3.1453356341833523,0]
[{"$f":"\"DMD1676\"","v":"DMD1676"},{"$f":"\"BLUE\"","v":"BLUE"},"Normal Solid","DBC MET",{"$f":"\"20000275\"","v":"20000275"},{"$f":"\"7.961\"","v":"7.961"},{"$f":"\"27.32\"","v":"27.32"},{"$f":"\"20.79\"","v":"20.79"},"0",3.1838265579342302,0]
[{"$f":"\"DMD1677\"","v":"DMD1677"},{"$f":"\"RED\"","v":"RED"},"Normal Solid","DBC MET",{"$f":"\"20000276\"","v":"20000276"},{"$f":"\"7.981\"","v":"7.981"},{"$f":"\"28.05\"","v":"28.05"},{"$f":"\"21.45\"","v":"21.45"},"0",2.8861697195332079,0]
[{"$f":"\"DMD1678\"","v":"DMD1678"},{"$f":"\"GREEN\"","v":"GREEN"},"Normal Solid","DBC MET",{"$f":"\"20000277\"","v":"20000277"},{"$f":"\"8.059\"","v":"8.059"},{"$f":"\"28.45\"","v":"28.45"},{"$f":"\"21.07\"","v":"21.07"},"0",3.4360326728741839,0]
[{"$f":"\"DMD1679\"","v":"DMD1679"},{"$f":"\"RED\"","v":"RED"},"Normal Solid","DBC MET",{"$f":"\"20000278\"","v":"20000278"},{"$f":"\"7.824\"","v":"7.824"},{"$f":"\"23.4\"","v":"23.4"},{"$f":"\"17.97\"","v":"17.97"},"0",2.9364053395624787,0]
[{"$f":"\"DMD1680\"","v":"DMD1680"},{"$f":"\"FINE ALUM.\"","v":"FINE ALUM."},{"$f":"\"Metallic\"","v":"Metallic"},"DBC MET",{"$f":"\"20000279\"","v":"20000279"},{"$f":"\"7.907\"","v":"7.907"},{"$f":"\"24.02\"","v":"24.02"},{"$f":"\"17.47\"","v":"17.47"},"0",2.6527754762136806,0]
[{"$f":"\"DMD1681\"","v":"DMD1681"},{"$f":"\"MED. ALUM.\"","v":"MED. ALUM."},{"$f":"\"Metallic\"","v":"Metallic"},"DBC MET",{"$f":"\"20000280\"","v":"20000280"},{"$f":"\"7.892\"","v":"7.892"},{"$f":"\"23.88\"","v":"23.88"},{"$f":"\"17.33\"","v":"17.33"},"0",2.7149591565278186,0]
[{"$f":"\"DMD1682\"","v":"DMD1682"},{"$f":"\"CRS. ALUM.\"","v":"CRS. ALUM."},{"$f":"\"Metallic\"","v":"Metallic"},"DBC MET",{"$f":"\"20000281\"","v":"20000281"},{"$f":"\"7.896\"","v":"7.896"},{"$f":"\"23.91\"","v":"23.91"},{"$f":"\"17.48\"","v":"17.48"},"0",2.7540120228727085,0]
[{"$f":"\"DMD1683\"","v":"DMD1683"},{"$f":"\"BLACK\"","v":"BLACK"},{"$f":"\"Normal Solid\"","v":"Normal Solid"},"DBC MET",{"$f":"\"20000282\"","v":"20000282"},{"$f":"\"7.605\"","v":"7.605"},{"$f":"\"19\"","v":"19"},{"$f":"\"15\"","v":"15"},"0",5.0031271160560005,0]
[{"$f":"\"DMD1684\"","v":"DMD1684"},{"$f":"\"WHITE\"","v":"WHITE"},{"$f":"\"Normal Solid\"","v":"Normal Solid"},"DBC MET",{"$f":"\"20000283\"","v":"20000283"},{"$f":"\"10.85\"","v":"10.85"},{"$f":"\"52.06\"","v":"52.06"},{"$f":"\"29.51\"","v":"29.51"},"0",2.3910802950248202,0]
[{"$f":"\"DMD1685\"","v":"DMD1685"},{"$f":"\"SUPER FINE BRIGHT ALUMINUM\"","v":"SUPER FINE BRIGHT ALUMINUM"},{"$f":"\"Metallic\"","v":"Metallic"},"DBC MET",{"$f":"\"64003234\"","v":"64003234"},{"$f":"\"7.844\"","v":"7.844"},{"$f":"\"22.69\"","v":"22.69"},{"$f":"\"16.86\"","v":"16.86"},"0",1.5002289726997202,0]
[{"$f":"\"DMD1686\"","v":"DMD1686"},{"$f":"\"FINE ALUM.\"","v":"FINE ALUM."},{"$f":"\"Metallic\"","v":"Metallic"},"DBC MET",{"$f":"\"20000284\"","v":"20000284"},{"$f":"\"7.867\"","v":"7.867"},{"$f":"\"23.45\"","v":"23.45"},{"$f":"\"17.11\"","v":"17.11"},"0",2.769536828051157,0]
[{"$f":"\"DMD1687\"","v":"DMD1687"},{"$f":"\"MED. ALUM.\"","v":"MED. ALUM."},{"$f":"\"Metallic\"","v":"Metallic"},"DBC MET",{"$f":"\"20000285\"","v":"20000285"},{"$f":"\"7.861\"","v":"7.861"},{"$f":"\"23.47\"","v":"23.47"},{"$f":"\"17.38\"","v":"17.38"},"0",3.0054256774343782,0]
[{"$f":"\"DMD1690\"","v":"DMD1690"},{"$f":"\"CRS. ALUM.\"","v":"CRS. ALUM."},{"$f":"\"Metallic\"","v":"Metallic"},"DBC MET",{"$f":"\"20000286\"","v":"20000286"},{"$f":"\"7.861\"","v":"7.861"},{"$f":"\"23.48\"","v":"23.48"},{"$f":"\"17.12\"","v":"17.12"},"0",2.7592241381174429,0]
[{"$f":"\"DMD1692\"","v":"DMD1692"},{"$f":"\"RED\"","v":"RED"},{"$f":"\"Normal Solid\"","v":"Normal Solid"},"DBC MET",{"$f":"\"20000287\"","v":"20000287"},{"$f":"\"7.991\"","v":"7.991"},{"$f":"\"29.6\"","v":"29.6"},{"$f":"\"22.93\"","v":"22.93"},"0",3.0399523040429886,0]
[{"$f":"\"DMD1693\"","v":"DMD1693"},{"$f":"\"GREEN\"","v":"GREEN"},{"$f":"\"Normal Solid\"","v":"Normal Solid"},"DBC MET",{"$f":"\"20000288\"","v":"20000288"},{"$f":"\"7.982\"","v":"7.982"},{"$f":"\"27.38\"","v":"27.38"},{"$f":"\"20.54\"","v":"20.54"},"0",3.4615565568347324,0]
[{"$f":"\"DMD1694\"","v":"DMD1694"},{"$f":"\"MAROON\"","v":"MAROON"},{"$f":"\"Normal Solid\"","v":"Normal Solid"},"DBC MET",{"$f":"\"20000289\"","v":"20000289"},{"$f":"\"7.873\"","v":"7.873"},{"$f":"\"23.09\"","v":"23.09"},{"$f":"\"16.47\"","v":"16.47"},"0",3.2947796494266122,0]
[{"$f":"\"DMD1696\"","v":"DMD1696"},{"$f":"\"COARSE SILVER DOLLAR ALUMINUM\"","v":"COARSE SILVER DOLLAR ALUMINUM"},{"$f":"\"Metallic\"","v":"Metallic"},"DBC MET",{"$f":"\"64000185\"","v":"64000185"},{"$f":"\"7.982\"","v":"7.982"},{"$f":"\"24.47\"","v":"24.47"},{"$f":"\"18.67\"","v":"18.67"},"0",2.903721890800913,0]
[{"$f":"\"DMD1697\"","v":"DMD1697"},{"$f":"\"MAROON\"","v":"MAROON"},{"$f":"\"Normal Solid\"","v":"Normal Solid"},"DBC MET",{"$f":"\"20000290\"","v":"20000290"},{"$f":"\"7.838\"","v":"7.838"},{"$f":"\"23.44\"","v":"23.44"},{"$f":"\"17.92\"","v":"17.92"},"0",2.9443350165271274,0]
[{"$f":"\"DMD1698\"","v":"DMD1698"},{"$f":"\"ALUM.\"","v":"ALUM."},{"$f":"\"Other special effect\"","v":"Other special effect"},"DBC MET",{"$f":"\"20000291\"","v":"20000291"},{"$f":"\"7.951\"","v":"7.951"},{"$f":"\"25.38\"","v":"25.38"},{"$f":"\"17.72\"","v":"17.72"},"0",3.2833729989524745,0]
[{"$f":"\"DMD613\"","v":"DMD613"},{"$f":"\"BLUE\"","v":"BLUE"},{"$f":"\"Normal Solid\"","v":"Normal Solid"},"DBC MET",{"$f":"\"20000295\"","v":"20000295"},{"$f":"\"8.231\"","v":"8.231"},{"$f":"\"49.99\"","v":"49.99"},{"$f":"\"43.39\"","v":"43.39"},"0",1.2083982526822401,0]
[{"$f":"\"DMD614\"","v":"DMD614"},{"$f":"\"BLUE\"","v":"BLUE"},{"$f":"\"Normal Solid\"","v":"Normal Solid"},"DBC MET",{"$f":"\"20000296\"","v":"20000296"},{"$f":"\"8.192\"","v":"8.192"},{"$f":"\"50.52\"","v":"50.52"},{"$f":"\"43.85\"","v":"43.85"},"0",1.2179722916131199,0]
[{"$f":"\"DMD615\"","v":"DMD615"},{"$f":"\"BLUE\"","v":"BLUE"},{"$f":"\"Normal Solid\"","v":"Normal Solid"},"DBC MET",{"$f":"\"20000297\"","v":"20000297"},{"$f":"\"8.179\"","v":"8.179"},{"$f":"\"49.38\"","v":"49.38"},{"$f":"\"42.68\"","v":"42.68"},"0",1.2531218389916796,0]
[{"$f":"\"DMD619\"","v":"DMD619"},{"$f":"\"BLUE SHADE VIOLET\"","v":"BLUE SHADE VIOLET"},{"$f":"\"Normal Solid\"","v":"Normal Solid"},"DBC MET",{"$f":"\"64002125\"","v":"64002125"},{"$f":"\"8.11\"","v":"8.11"},{"$f":"\"47.02\"","v":"47.02"},{"$f":"\"40.61\"","v":"40.61"},{"$f":"\"0.01\"","v":"0.01"},0,0]
[{"$f":"\"DMD622\"","v":"DMD622"},{"$f":"\"RED\"","v":"RED"},{"$f":"\"Normal Solid\"","v":"Normal Solid"},"DBC MET",{"$f":"\"20000303\"","v":"20000303"},{"$f":"\"8.615\"","v":"8.615"},{"$f":"\"52.24\"","v":"52.24"},{"$f":"\"43.03\"","v":"43.03"},{"$f":"\"0\"","v":"0"},1.2505830661331203,0]
[{"$f":"\"DMD641\"","v":"DMD641"},{"$f":"\"YELLOW\"","v":"YELLOW"},{"$f":"\"Normal Solid\"","v":"Normal Solid"},"DBC MET",{"$f":"\"20000322\"","v":"20000322"},{"$f":"\"8.65\"","v":"8.65"},{"$f":"\"52.25\"","v":"52.25"},{"$f":"\"43.07\"","v":"43.07"},"0",1.2325340889912608,0]
[{"$f":"\"DMD642\"","v":"DMD642"},{"$f":"\"YELLOW\"","v":"YELLOW"},"Normal Solid","DBC MET",{"$f":"\"20000323\"","v":"20000323"},{"$f":"\"8.897\"","v":"8.897"},{"$f":"\"55.37\"","v":"55.37"},{"$f":"\"45.01\"","v":"45.01"},"0",1.2079036183820802,0]
[{"$f":"\"DMD646\"","v":"DMD646"},{"$f":"\"WEAK WHITE\"","v":"WEAK WHITE"},"Normal Solid","DBC MET",{"$f":"\"20000327\"","v":"20000327"},{"$f":"\"8.817\"","v":"8.817"},{"$f":"\"53.8\"","v":"53.8"},{"$f":"\"43.99\"","v":"43.99"},"0",1.2358215945838691,0]
{"$rows_left_out":328}